{"text_format":"1","workbook":"xlsx","n_sheets":7,"sheets":["(hidden)list of Names","Settings","Custom Shortcuts","(hidden) Win & Mac Shortcuts","Link Format Exceptions","Capitalised Word Exceptions","Languages"],"not_rendered":{"charts":0,"images":0,"macros":1,"external_links":0,"defined_names":49,"comments":2,"pivot_tables":0},"unopened":[],"bounds":{"document_bytes":16777216,"sheet_cells":100000,"rows_first":2000,"rows_last":500,"rows_between":2000,"halvings":0,"cell_chars":16384,"cell_head_chars":4096},"cells_cut":0,"cells_raw":0,"read":"whole","date_system":"1900"}

{"sheet":"(hidden)list of Names","index":0,"n_rows":114,"n_cols":10,"rows_kept":114,"cut":false,"hidden":true,"merged":[]}
["2022-04-07T10:15:21","Name","RefersTo","Visible","Value","20/04/2022  v022 unused names greyed out, to be deleted","Name","RefersTo","Visible","Value"]
[null,"'Custom Shortcuts'!_FilterDatabase","='Custom Shortcuts'!$B$14:$AZJ$105",false,"Array(1 to 92,1 to 1361)","","'Custom Shortcuts'!_FilterDatabase","='Custom Shortcuts'!$B$14:$AZJ$104",false,"Array(1 to 91,1 to 1361)"]
[null,"_xlfn.XLOOKUP","=#NAME?",false,"=#NAME?","","_xlfn.XLOOKUP",null,false,"=#NAME?"]
[null,"AutoFormatting","=Misc!$D$7",true,true,"","AutoFormatting","=Settings!$B$7",true,true]
[null,"bMacrosRun","=Misc!$D$6",true,true,"","bMacrosRun","=Settings!$B$6",true,true]
[null,"bRebindKeysOnFirstInvoke","=Misc!$D$5",true,true,"","bTestMode","=Settings!$B$3",true,false]
[null,"bTestMode","=Misc!$D$3",true,false,"","CASmodifiers","=Settings!$B$29:$B$32",true,"Array(1 to 4,1 to 1)"]
[null,"CASmodifiers","=Misc!$F$3:$F$6",true,"Array(1 to 4,1 to 1)","","cf_AddChangeLog","='Custom Shortcuts'!$G$25",true,1]
[null,"cf_AddChangeLog","='Custom Shortcuts'!$G$25",true,1,"","cf_AddSparkline","='Custom Shortcuts'!$G$32",true,"S"]
[null,"cf_AddSparkline","='Custom Shortcuts'!$G$33",true,"S","","cf_Anchoring","='Custom Shortcuts'!$G$21",true,"A"]
[null,"cf_Anchoring","='Custom Shortcuts'!$G$21",true,"A","","cf_Black","='Custom Shortcuts'!$G$59",true,"B"]
[null,"cf_Black","='Custom Shortcuts'!$G$60",true,"B","","cf_Border","='Custom Shortcuts'!$G$62",true,"D"]
[null,"cf_Border","='Custom Shortcuts'!$G$63",true,"D","","cf_Brackets","='Custom Shortcuts'!$G$63",true,"T"]
[null,"cf_Brackets","='Custom Shortcuts'!$G$64",true,"T","","cf_ChangeColours","='Custom Shortcuts'!#REF!",true,"='Custom Shortcuts'!#REF!"]
[null,"cf_ChangeColours","='Custom Shortcuts'!$G$28",true,4,"","cf_ClearFill","='Custom Shortcuts'!$G$48",true,"C"]
[null,"cf_ClearFill","='Custom Shortcuts'!$G$49",true,"C","","cf_CollapseGroup","='Custom Shortcuts'!$G$70",true,"E"]
[null,"cf_CollapseGroup","='Custom Shortcuts'!$G$71",true,"E","","cf_CopyAcross","='Custom Shortcuts'!$G$16",true,"A"]
[null,"cf_CopyAcross","='Custom Shortcuts'!$G$16",true,"A","","cf_CounterflowFill","='Custom Shortcuts'!$G$52",true,"O"]
[null,"cf_CounterflowFill","='Custom Shortcuts'!$G$53",true,"O","","cf_CreateOutputTrack","='Custom Shortcuts'!$G$28",true,5]
[null,"cf_CreateOutputTrack","='Custom Shortcuts'!$G$29",true,5,"","cf_DateStyle","='Custom Shortcuts'!$G$43",true,"L"]
[null,"cf_DateStyle","='Custom Shortcuts'!$G$44",true,"L","","cf_DecreaseZero","='Custom Shortcuts'!$G$39",true,","]
[null,"cf_DecreaseZero","='Custom Shortcuts'!$G$40",true,",","","cf_DeleteCondFormat","='Custom Shortcuts'!$G$34",true,8]
[null,"cf_DeleteCondFormat","='Custom Shortcuts'!$G$35",true,8,"","cf_DeleteSheet","='Custom Shortcuts'!$G$30",true,"-"]
[null,"cf_DeleteSheet","='Custom Shortcuts'!$G$31",true,"-","","cf_Exceptions","='Custom Shortcuts'!$G$74",true,"E"]
[null,"cf_Exceptions","='Custom Shortcuts'!$G$75",true,"E","","cf_ExpandGroup","='Custom Shortcuts'!$G$69",true,"E"]
[null,"cf_ExpandGroup","='Custom Shortcuts'!$G$70",true,"E","","cf_Export","='Custom Shortcuts'!$G$61",true,"X"]
[null,"cf_Export","='Custom Shortcuts'!$G$62",true,"X","","cf_FactorStyle","='Custom Shortcuts'!$G$41",true,"."]
[null,"cf_FactorStyle","='Custom Shortcuts'!$G$42",true,".","","cf_GreenFill","='Custom Shortcuts'!$G$50",true,"G"]
[null,"cf_GreenFill","='Custom Shortcuts'!$G$51",true,"G","","cf_Hide","='Custom Shortcuts'!$G$29",true,7]
[null,"cf_Hide","='Custom Shortcuts'!$G$30",true,7,"","cf_Import","='Custom Shortcuts'!$G$60",true,"M"]
{"$rows_left_out":85}
{"sheet":"Settings","index":1,"n_rows":116,"n_cols":9,"rows_kept":116,"cut":false,"hidden":false,"merged":[]}
[null,null,null,{"$f":"\"To save and hide this workbook, press \" & VLOOKUP(\"ToggleVisiblePPM\",'Custom Shortcuts'!$B$1:$H$76,4,FALSE)","v":"To save and hide this workbook, press Ctrl + Shift + 7"}]
[null,null,null,"Note: hidden columns contain information used by the macros. Do not delete"]
[]
["USER SETTINGS",null,null,null,"Setting value","Range Name"]
[]
[null,null,"Calculation Mode",null,"Manual","Calculation_Setting"]
[]
[null,null,"Ctrl+Shift+4 Translation service"]
[null,null,null,"Azure Translator key",null,"Azure_Translator_Key"]
[null,null,null,"Azure Translator Region",null,"Azure_Translator_Region"]
[]
[null,null,"SPARKLINES (default line style applied)"]
[null,null,null,"Colour of line",12566463,"Sparkline_RGB"]
[null,null,null,"Weight of line in points",0.5,"Sparkline_Weight"]
[null,null,null,"Start column","J","Sparkline_StartColumn"]
[null,null,null,"End column",null,"Sparkline_EndColumn"]
[]
[null,null,"Column use convention",null,"Column Letter",null,"Column Number","Range name"]
[null,null,null,"Label Column","E","LABEL_INP",{"$f":"COLUMN(INDIRECT(E19&\"1\"))","v":5},"LabelColumn"]
[null,null,null,"Query Column","E","Query_Inp",{"$f":"COLUMN(INDIRECT(E20&\"1\"))","v":5},"QueryColumn"]
[null,null,null,"Constant Column","F","COL_INP",{"$f":"COLUMN(INDIRECT(E21&\"1\"))","v":6},"ConstantColumn"]
[null,null,null,"Units Column","G","UNITS_INP",{"$f":"COLUMN(INDIRECT(E22&\"1\"))","v":7},"UnitsColumn"]
[null,null,null,"Totals column","H","TOT_INP",{"$f":"COLUMN(INDIRECT(E23&\"1\"))","v":8},"TotalsColumn"]
[null,null,null,"Time series start","J","ROW_INP",{"$f":"COLUMN(INDIRECT(E24&\"1\"))","v":10},"TimeSeriesStartColumn"]
[]
[null,null,"Other options"]
[null,null,null,"Link to blank cells on copy across",true]
[]
[]
[null,null,"User Defined Formats",null,null,"UserDefinedFormats"]
{"$rows_left_out":87}
{"sheet":"Custom Shortcuts","index":2,"n_rows":52,"n_cols":16,"rows_kept":52,"cut":false,"hidden":false,"merged":[]}
["Type","Macro","Active","Action","Keyboard Shortcut","Mac Modifier Key(s)","Win Modifier Key(s)","Custom Key","Mnemonic","(unused column)","Key length check","Duplicate if >1 each shortcut","Modifier check","Error check","Excel shortcut check (Excel_Shortcuts is a range on the hidden sheet Win & Mac Shortcuts)","Documentation: What range names does this macro use?\nEvery macro uses bMacrosRun & OnKey_Table.\nInit uses Calculation_Setting\nAll forms use UF_Scaling"]
["Utilities","AddToChangeLog",true,"Add To Change Log",{"$f":"IF(MacOS, F2,G2) & \" \" & H2","v":"Ctrl + Shift + 1"},{"$f":"IF( G2=\"Ctrl + Alt +\",\"Ctrl + \" & MacModifierKey,G2&\"\")","v":"Ctrl + Shift +"},"Ctrl + Shift +",1,null,null,{"$f":"LEN(H2)","v":1},{"$f":"COUNTIF(INDEX(OnKey_Table,0,COLUMN(E1)),$E2)","v":1},{"$f":"MATCH(G2,CASmodifiers,0)","v":2},{"$f":"IF(AND(K2=1,L2=1,NOT(ISERROR(M2))),0,1)","v":0},{"$f":"_xlfn.XLOOKUP(SUBSTITUTE(E2,\" \",\"\"),INDEX(Excel_Shortcuts,0,IF(WinOS,4,5)),INDEX(Excel_Shortcuts,0,1),\"\",0)","v":""},"ChangeLogStartRow,ChangeLogTimelineStart,ChangeLogTitleRow,InputStored,LabelColumn"]
[null,"HardCodeChangeLog",true,"Save Change Log Values","Ctrl + Shift + 2","Ctrl + Shift +","Ctrl + Shift +",2,null,null,{"$f":"LEN(H3)","v":1},1,{"$f":"MATCH(G3,CASmodifiers,0)","v":2},{"$f":"IF(AND(K3=1,L3=1,NOT(ISERROR(M3))),0,1)","v":0},{"$f":"_xlfn.XLOOKUP(SUBSTITUTE(E3,\" \",\"\"),INDEX(Excel_Shortcuts,0,IF(WinOS,4,5)),INDEX(Excel_Shortcuts,0,1),\"\",0)","v":""},"ChangeLogLatestValueColumn,ChangeLogTimelineStart"]
[null,"TranslateSelection",true,"Translate Selection","Ctrl + Shift + 4","Ctrl + Shift +","Ctrl + Shift +",4,null,null,{"$f":"LEN(H4)","v":1},1,{"$f":"MATCH(G4,CASmodifiers,0)","v":2},{"$f":"IF(AND(K4=1,L4=1,NOT(ISERROR(M4))),0,1)","v":0},{"$f":"_xlfn.XLOOKUP(SUBSTITUTE(E4,\" \",\"\"),INDEX(Excel_Shortcuts,0,IF(WinOS,4,5)),INDEX(Excel_Shortcuts,0,1),\"\",0)","v":""},"ISO639_Data,UF_Scaling,Azure_Translation_Key,Azure_Translation_Region"]
[null,"StoreTrack",true,"Create Output Track","Ctrl + Shift + 5","Ctrl + Shift +","Ctrl + Shift +",5,null,null,{"$f":"LEN(H5)","v":1},1,{"$f":"MATCH(G5,CASmodifiers,0)","v":2},{"$f":"IF(AND(K5=1,L5=1,NOT(ISERROR(M5))),0,1)","v":0},{"$f":"_xlfn.XLOOKUP(SUBSTITUTE(E5,\" \",\"\"),INDEX(Excel_Shortcuts,0,IF(WinOS,4,5)),INDEX(Excel_Shortcuts,0,1),\"\",0)","v":""},"TrackStoredResults,TrackActive,TrackLiveResults"]
[null,"PrepareForRelease",true,"Bring up selection userform","Ctrl + Shift + 6","Ctrl + Shift +","Ctrl + Shift +",6,null,null,1,1,2,0,{"$f":"_xlfn.XLOOKUP(SUBSTITUTE(E6,\" \",\"\"),INDEX(Excel_Shortcuts,0,IF(WinOS,4,5)),INDEX(Excel_Shortcuts,0,1),\"\",0)","v":""},"TimeSeriesStartColumn,lstCapitalisationExceptions,LABEL_INP,Corkscrew_withBal,Corkscrew_NoBal,LabelColumn,ConstantColumn,UnitsColumn,TotalsColumn,TimeSeriesStartColumn,UNITS_INP"]
[null,"ToggleVisiblePPM",true,"Unhide / Rehide & Save Macro File","Ctrl + Shift + 7","Ctrl + Shift +","Ctrl + Shift +",7,null,null,1,1,2,0,{"$f":"_xlfn.XLOOKUP(SUBSTITUTE(E7,\" \",\"\"),INDEX(Excel_Shortcuts,0,IF(WinOS,4,5)),INDEX(Excel_Shortcuts,0,1),\"\",0)","v":""}]
[null,"DeleteConditionalFormat",true,"Delete selected Conditional Format(s)","Ctrl + Shift + 8","Ctrl + Shift +","Ctrl + Shift +",8,null,null,1,1,2,0,{"$f":"_xlfn.XLOOKUP(SUBSTITUTE(E8,\" \",\"\"),INDEX(Excel_Shortcuts,0,IF(WinOS,4,5)),INDEX(Excel_Shortcuts,0,1),\"\",0)","v":""}]
[null,"VarianceReport",true,"Create Variance tabs","Ctrl + Shift + 9","Ctrl + Shift +","Ctrl + Shift +",9,null,null,1,1,2,0,{"$f":"_xlfn.XLOOKUP(SUBSTITUTE(E9,\" \",\"\"),INDEX(Excel_Shortcuts,0,IF(WinOS,4,5)),INDEX(Excel_Shortcuts,0,1),\"\",0)","v":""},"ROW_INP,VariancesOnUserform,VarRpt_MaxRows,VarRpt_MaxCols,VarPercentTab"]
[null,"DeleteSheet",true,"Delete Worksheet","Ctrl + Alt + -","Ctrl + Option + Shift +","Ctrl + Alt +","-","Minus to remove",null,1,1,3,0,{"$f":"_xlfn.XLOOKUP(SUBSTITUTE(E10,\" \",\"\"),INDEX(Excel_Shortcuts,0,IF(WinOS,4,5)),INDEX(Excel_Shortcuts,0,1),\"\",0)","v":"Zoom out"}]
[null,"Anchoring",true,"Anchoring","Ctrl + Alt + A","Ctrl + Option + Shift +","Ctrl + Alt +","A","A for Anchoring",null,1,1,3,0,{"$f":"_xlfn.XLOOKUP(SUBSTITUTE(E11,\" \",\"\"),INDEX(Excel_Shortcuts,0,IF(WinOS,4,5)),INDEX(Excel_Shortcuts,0,1),\"\",0)","v":""}]
[null,"CopyAcross",true,"Copy Across","Ctrl + Shift + A","Ctrl + Shift +","Ctrl + Shift +","A","A for Copy Across",null,1,1,2,0,{"$f":"_xlfn.XLOOKUP(SUBSTITUTE(E12,\" \",\"\"),INDEX(Excel_Shortcuts,0,IF(WinOS,4,5)),INDEX(Excel_Shortcuts,0,1),\"\",0)","v":"Insert function arguments"},"ConstantColumn,LabelColumn"]
[null,"ResetEnd",true,"Reset end cell / clear unused range","Ctrl + Alt + C","Ctrl + Option + Shift +","Ctrl + Alt +","C","C for Clear to end",null,1,{"$f":"COUNTIF(INDEX(OnKey_Table,0,COLUMN(E12)),$E13)","v":1},3,0,{"$f":"_xlfn.XLOOKUP(SUBSTITUTE(E13,\" \",\"\"),INDEX(Excel_Shortcuts,0,IF(WinOS,4,5)),INDEX(Excel_Shortcuts,0,1),\"\",0)","v":""},"Units_INP"]
[null,"PasteAsValue",true,"Paste As Value w/o Format","Ctrl + Alt + D","Ctrl + Option + Shift +","Ctrl + Alt +","D","D for Data",null,1,1,3,0,{"$f":"_xlfn.XLOOKUP(SUBSTITUTE(E14,\" \",\"\"),INDEX(Excel_Shortcuts,0,IF(WinOS,4,5)),INDEX(Excel_Shortcuts,0,1),\"\",0)","v":""}]
[null,"AmendExceptionSheets",true,"Exceptions","Ctrl + Alt + E","Ctrl + Option + Shift +","Ctrl + Alt +","E","E for Exceptions",null,1,1,3,0,{"$f":"_xlfn.XLOOKUP(SUBSTITUTE(E15,\" \",\"\"),INDEX(Excel_Shortcuts,0,IF(WinOS,4,5)),INDEX(Excel_Shortcuts,0,1),\"\",0)","v":""},"lstSheetsIgnore,lstCapitalisationExceptions"]
[null,"HelpKeys",true,"Show list of shortcuts","Ctrl + Alt + H","Ctrl + Option + Shift +","Ctrl + Alt +","H","H for Help",null,1,1,3,0,{"$f":"_xlfn.XLOOKUP(SUBSTITUTE(E16,\" \",\"\"),INDEX(Excel_Shortcuts,0,IF(WinOS,4,5)),INDEX(Excel_Shortcuts,0,1),\"\",0)","v":""},"OnKey_Table,CheckKeyLength,CheckKeyDuplicate,CheckModifierKeys"]
[null,"InsertSignSwitchRow",true,"Switch sign",{"$f":"IF(MacOS, F17,G17) & \" \" & H17","v":"Ctrl + Alt + N"},{"$f":"IF( G17=\"Ctrl + Alt +\",\"Ctrl + \" & MacModifierKey,G17&\"\")","v":"Ctrl + Option + Shift +"},"Ctrl + Alt +","N","N for Negation or sigN",null,{"$f":"LEN(H17)","v":1},{"$f":"COUNTIF(INDEX(OnKey_Table,0,COLUMN(E16)),$E17)","v":1},{"$f":"MATCH(G17,CASmodifiers,0)","v":3},{"$f":"IF(AND(K17=1,L17=1,NOT(ISERROR(M17))),0,1)","v":0},{"$f":"_xlfn.XLOOKUP(SUBSTITUTE(E17,\" \",\"\"),INDEX(Excel_Shortcuts,0,IF(WinOS,4,5)),INDEX(Excel_Shortcuts,0,1),\"\",0)","v":""}]
[null,"RowSummation",true,"Sum Across","Ctrl + Shift + N","Ctrl + Shift +","Ctrl + Shift +","N","N for SummatioN",null,1,{"$f":"COUNTIF(INDEX(OnKey_Table,0,COLUMN(E16)),$E18)","v":1},2,0,{"$f":"_xlfn.XLOOKUP(SUBSTITUTE(E18,\" \",\"\"),INDEX(Excel_Shortcuts,0,IF(WinOS,4,5)),INDEX(Excel_Shortcuts,0,1),\"\",0)","v":""},"TotalsColumn,ConstantColumn"]
[null,"RelocateOutput",true,"Relocate Outputs","Ctrl + Alt + O","Ctrl + Option + Shift +","Ctrl + Alt +","O","O for Outputs",null,1,1,3,0,{"$f":"_xlfn.XLOOKUP(SUBSTITUTE(E19,\" \",\"\"),INDEX(Excel_Shortcuts,0,IF(WinOS,4,5)),INDEX(Excel_Shortcuts,0,1),\"\",0)","v":""},"COL_INP,Units_Inp,TOT_INP,LABEL_INP,OutputRowTemplate"]
[null,"FAST_Placeholders",true,"Placeholders List with comments","Ctrl + Alt + P","Ctrl + Option + Shift +","Ctrl + Alt +","P","P for Placeholder list",null,1,1,3,0,{"$f":"_xlfn.XLOOKUP(SUBSTITUTE(E20,\" \",\"\"),INDEX(Excel_Shortcuts,0,IF(WinOS,4,5)),INDEX(Excel_Shortcuts,0,1),\"\",0)","v":""},"LABEL_INP"]
[null,"AddModelQuery",true,"Model Queries ","Ctrl + Alt + Q","Ctrl + Option + Shift +","Ctrl + Alt +","Q","Q for Query",null,1,1,3,0,{"$f":"_xlfn.XLOOKUP(SUBSTITUTE(E21,\" \",\"\"),INDEX(Excel_Shortcuts,0,IF(WinOS,4,5)),INDEX(Excel_Shortcuts,0,1),\"\",0)","v":""},"LabelColumn,Label_INP,QueryColumn"]
[null,"QuickLink",true,"Quick Link","Ctrl + Shift + Q","Ctrl + Shift +","Ctrl + Shift +","Q","Q for Quick link",null,1,1,2,0,{"$f":"_xlfn.XLOOKUP(SUBSTITUTE(E22,\" \",\"\"),INDEX(Excel_Shortcuts,0,IF(WinOS,4,5)),INDEX(Excel_Shortcuts,0,1),\"\",0)","v":""},"lstSheetsIgnore"]
[null,"RelocateInput",true,"Relocate Inputs","Ctrl + Alt + R","Ctrl + Option + Shift +","Ctrl + Alt +","R","R for Relocate",null,1,1,3,0,{"$f":"_xlfn.XLOOKUP(SUBSTITUTE(E23,\" \",\"\"),INDEX(Excel_Shortcuts,0,IF(WinOS,4,5)),INDEX(Excel_Shortcuts,0,1),\"\",0)","v":""},"CASE_ACTIVE,InputRowTemplate,ConstantColumn,TimeSeriesStartColumn,ROW_INP,COL_INP,LabelColumn"]
[null,"PasteAsValueFormat",true,"Paste Format From Copied Range","Ctrl + Alt + S","Ctrl + Option + Shift +","Ctrl + Alt +","S","S for paSte",null,1,1,3,0,{"$f":"_xlfn.XLOOKUP(SUBSTITUTE(E24,\" \",\"\"),INDEX(Excel_Shortcuts,0,IF(WinOS,4,5)),INDEX(Excel_Shortcuts,0,1),\"\",0)","v":""}]
[null,"AddSparkline",true,"Add Sparkline in column F","Ctrl + Shift + S","Ctrl + Shift +","Ctrl + Shift +","S","S for Sparkline",null,1,1,2,0,{"$f":"_xlfn.XLOOKUP(SUBSTITUTE(E25,\" \",\"\"),INDEX(Excel_Shortcuts,0,IF(WinOS,4,5)),INDEX(Excel_Shortcuts,0,1),\"\",0)","v":""},"ConstantColumn,Sparkline_StartColumn,Sparkline_EndColumn,Sparkline_RGB,Sparkline_Weight"]
[null,"other_Brackets",true,"Square Brackets","Ctrl + Shift + T","Ctrl + Shift +","Ctrl + Shift +","T","T for Temporary",null,1,1,2,0,{"$f":"_xlfn.XLOOKUP(SUBSTITUTE(E26,\" \",\"\"),INDEX(Excel_Shortcuts,0,IF(WinOS,4,5)),INDEX(Excel_Shortcuts,0,1),\"\",0)","v":"Toggle table total row"}]
["Navigation","Group_Expand",true,"Expand Group","Ctrl + E","Ctrl +","Ctrl +","E","E for Expand",null,1,1,1,0,{"$f":"_xlfn.XLOOKUP(SUBSTITUTE(E27,\" \",\"\"),INDEX(Excel_Shortcuts,0,IF(WinOS,4,5)),INDEX(Excel_Shortcuts,0,1),\"\",0)","v":"Flash fill"}]
[null,"Group_Collapse",true,"Collapse Group","Ctrl + Shift + E","Ctrl + Shift +","Ctrl + Shift +","E","E for CollapsE",null,1,1,2,0,{"$f":"_xlfn.XLOOKUP(SUBSTITUTE(E28,\" \",\"\"),INDEX(Excel_Shortcuts,0,IF(WinOS,4,5)),INDEX(Excel_Shortcuts,0,1),\"\",0)","v":""}]
[null,"other_JumpLink",true,"Jump to Precedent","Ctrl + Shift + J","Ctrl + Shift +","Ctrl + Shift +","J","J for Jump",null,1,1,2,0,{"$f":"_xlfn.XLOOKUP(SUBSTITUTE(E29,\" \",\"\"),INDEX(Excel_Shortcuts,0,IF(WinOS,4,5)),INDEX(Excel_Shortcuts,0,1),\"\",0)","v":""}]
[null,"other_JumpHome",true,"Return from Jump","Ctrl + Shift + K","Ctrl + Shift +","Ctrl + Shift +","K","Next to J",null,1,1,2,0,{"$f":"_xlfn.XLOOKUP(SUBSTITUTE(E30,\" \",\"\"),INDEX(Excel_Shortcuts,0,IF(WinOS,4,5)),INDEX(Excel_Shortcuts,0,1),\"\",0)","v":""}]
{"$rows_left_out":23}
{"sheet":"(hidden) Win & Mac Shortcuts","index":3,"n_rows":244,"n_cols":6,"rows_kept":244,"cut":false,"hidden":true,"merged":[]}
["Action","WinKB","MacKB","Win","Mac","Although not documented, Ctrl+key in Mac usually works the same as Cmd+key.\nExcept for Cmd+H (Finder:Hide window)"]
["Create new workbook","CtrlN","⌘N","Ctrl+N","Cmd+N","UNICODE(\"⌘\") = 8984"]
["Open workbook","CtrlO","⌘O","Ctrl+O","Cmd+O","UNICODE(\"⇧\") = 8679"]
["Save workbook","CtrlS","⌘S","Ctrl+S","Cmd+S","UNICODE(\"⌃\") = 8963"]
["Save as","F12","⌘⇧S","F12","Cmd+Shift+S","Cmd+Shift+s"]
["Print file","CtrlP","⌘P","Ctrl+P","Cmd+P"]
["Open print preview window","CtrlF2","","Ctrl+F2",""]
["Close current workbook","CtrlW","⌘W","Ctrl+W","Cmd+W","Win:Ctrl+F4  (Mac: Activity Monitor)"]
["Close Excel","AltF4","⌘Q","Alt+F4","Cmd+Q"]
["Expand or collapse ribbon","CtrlF1","⌘⌥R","Ctrl+F1","Cmd+Option+R","UNICODE(\"⌥\") = 8997"]
["Activate access keys","Alt","","Alt+",""]
["Move to next ribbon control","Tab","Tab","Tab","Tab"]
["Activate or open selected control","Space","Space","Space","Space"]
["Confirm control change","Enter","Return","Enter","Return"]
["Get help on selected control","F1","","F1",""]
["Open options","AltFT","⌘,","Alt+FT","Cmd+,"]
["Open help","F1","⌘/","F1","Cmd+/"]
["Undo last action","CtrlZ","⌘Z","Ctrl+Z","Cmd+Z"]
["Redo last action","CtrlY","⌘Y","Ctrl+Y","Cmd+Y"]
["Copy selected cells","CtrlC","⌘C","Ctrl+C","Cmd+C"]
["Repeat last action","F4","⌘Y","F4","Cmd+Y"]
["Cut selected cells","CtrlX","⌘X","Ctrl+X","Cmd+X"]
["Paste content from clipboard","CtrlV","⌘V","Ctrl+V","Cmd+V"]
["Display the Paste Special dialog box","CtrlAltV","⌘⌃V","Ctrl+Alt+V","Cmd+Ctrl+V","Cmd+Option+V"]
["Display find and replace","CtrlF","⌘F","Ctrl+F","Cmd+F"]
["Display find and replace, replace selected","CtrlH","⌃H","Ctrl+H","Ctrl+H","Cmd+h (Finder:Hide window)"]
["Find next match","ShiftF4","⌘G","Shift+F4","Cmd+G"]
["Find previous match","CtrlShiftF4","⌘⇧G","Ctrl+Shift+F4","Cmd+Shift+G","Cmd+Shift+g"]
["Create embedded chart","AltF1","Fn⌥F1","Alt+F1","Fn+Option+F1"]
["Create chart in new worksheet","F11","FnF11","F11","Fn+F11"]
{"$rows_left_out":215}
{"sheet":"Link Format Exceptions","index":4,"n_rows":11,"n_cols":3,"rows_kept":11,"cut":false,"hidden":false,"merged":[]}
["Sheets to not change","Export Exception","Import Exception"]
["Change",false,false]
["FinStat",true,true]
["FS",true,true]
["FS Qtr",true,true]
["FS Qtr P90",true,true]
["FSAnn",true,true]
["InpC",true,true]
["InpS",true,true]
["InpS_M",true,true]
["Tmp",true,true]

{"sheet":"Capitalised Word Exceptions","index":5,"n_rows":44,"n_cols":1,"rows_kept":44,"cut":false,"hidden":false,"merged":[]}
["Words to not change"]
["AEP"]
["BEG"]
["CHF"]
["COD"]
["DSCR"]
["DSRA"]
["EBIT"]
["EBITDA"]
["EBL"]
["EGR"]
["EGRs"]
["EPC"]
["FC"]
["GBP"]
["GWh to kWh conversion"]
["IBRD"]
["IEP"]
["IEPs"]
["IFRIC"]
["IFRIC12"]
["IFRS"]
["IRR"]
["LC"]
["LLCR"]
["LNTP"]
["MIGA"]
["MMRA"]
["NPV"]
["O&M"]
{"$rows_left_out":15}
{"sheet":"Languages","index":6,"n_rows":113,"n_cols":4,"rows_kept":113,"cut":false,"hidden":false,"merged":[]}
["ISO639","name","nativeName","dir"]
[null,"(automatic)"]
["en","English","English","ltr"]
["de","German","Deutsch","ltr"]
["es","Spanish","Español","ltr"]
["fr","French","Français","ltr"]
["af","Afrikaans","Afrikaans","ltr"]
["am","Amharic","አማርኛ","ltr"]
["ar","Arabic","العربية","rtl"]
["as","Assamese","অসমীয়া","ltr"]
["az","Azerbaijani","Azərbaycan","ltr"]
["ba","Bashkir","Bashkir","ltr"]
["bg","Bulgarian","Български","ltr"]
["bn","Bangla","বাংলা","ltr"]
["bo","Tibetan","བོད་སྐད་","ltr"]
["bs","Bosnian","Bosnian","ltr"]
["ca","Catalan","Català","ltr"]
["cs","Czech","Čeština","ltr"]
["cy","Welsh","Cymraeg","ltr"]
["da","Danish","Dansk","ltr"]
["dv","Divehi","ދިވެހިބަސް","rtl"]
["el","Greek","Ελληνικά","ltr"]
["et","Estonian","Eesti","ltr"]
["eu","Basque","Euskara","ltr"]
["fa","Persian","فارسی","rtl"]
["fi","Finnish","Suomi","ltr"]
["fil","Filipino","Filipino","ltr"]
["fj","Fijian","Na Vosa Vakaviti","ltr"]
["fo","Faroese","Føroyskt","ltr"]
["fr-CA","French (Canada)","Français (Canada)","ltr"]
{"$rows_left_out":83}